{"text_format":"1","workbook":"xlsx","n_sheets":9,"sheets":["Trade Journal","Trade","World","Animals","Animal Tables","Trade Tables","World Tables","Civilization Tables","Rolls"],"not_rendered":{"charts":0,"images":0,"macros":1,"external_links":0,"defined_names":1,"comments":1,"pivot_tables":0},"unopened":[],"bounds":{"document_bytes":16777216,"sheet_cells":100000,"rows_first":2000,"rows_last":500,"rows_between":2000,"halvings":0,"cell_chars":16384,"cell_head_chars":4096},"cells_cut":0,"cells_raw":0,"read":"whole","date_system":"1904"}

{"sheet":"Trade Journal","index":0,"n_rows":76,"n_cols":24,"rows_kept":76,"cut":false,"hidden":false,"merged":[]}
[null,"Ship Trading Sheet"]
["Ship Name:","Tin Lizzie","Ship Type:","Type-A Free Trader"]
[]
["Armor / Hull / Structure:","4 / 4 / 4 = 12","Agility/Maneuver:"]
["Turret 1 (Laser/Sand):",null,"Turret 2 (Missile/Missile):"]
["Cargo Capacity:","80-88 tons","Life Support"]
{"$rows_left_out":71}
{"sheet":"Trade","index":1,"n_rows":68,"n_cols":54,"rows_kept":68,"cut":false,"hidden":false,"merged":[[25,9,25,11],[26,9,26,11],[27,9,27,11],[29,9,29,11],[30,9,30,11],[31,9,31,11],[32,9,32,11],[20,9,20,11],[21,9,21,11],[22,9,22,11],[23,9,23,11],[28,9,28,11],[24,9,24,11],[37,9,37,11],[38,9,38,11],[39,9,39,11],[40,9,40,11],[33,9,33,11],[34,9,34,11],[35,9,35,11],[36,9,36,11],[45,9,45,11],[46,9,46,11],[47,9,47,11],[48,9,48,11],[41,9,41,11],[42,9,42,11],[43,9,43,11],[44,9,44,11],[53,9,53,11],[54,9,54,11],[55,9,55,11],[49,9,49,11],[50,9,50,11],[51,9,51,11],[52,9,52,11]]}
[null,"Paste Current UWP:",{"$f":"'Trade Journal'!G48","v":"C"},{"$f":"'Trade Journal'!H48","v":6},{"$f":"'Trade Journal'!I48","v":8},{"$f":"'Trade Journal'!J48","v":6},{"$f":"'Trade Journal'!K48","v":8},{"$f":"'Trade Journal'!L48","v":5},{"$f":"'Trade Journal'!M48","v":4},"–",{"$f":"'Trade Journal'!O48","v":5}]
[null,"Passengers and Freight looking for a ship",null,null,null,null,null,null,null,null,null,null,null,null,null,null,null,null,null,null,null,null,null,null,null,null,null,null,null,null,null,null,null,null,null,null,null,null,null,null,null,"ShipType","Revenue"]
["Distance (PC)",null,"Ag","As","Ba","De","Fl","Ga","Hi","Ht","IC","In","Lo","Lt","Na","NI","Po","Ri","Wa","Va",null,null,null,null,null,null,null,null,null,null,null,null,null,null,null,null,null,null,null,null,null,"Type-A",{"$f":"B5+B9","v":103200}]
[{"$f":"'Trade Journal'!D53","v":2},"Enter Desination Trade Codes:",{"$f":"'Trade Journal'!G56","v":0},{"$f":"'Trade Journal'!H56","v":0},{"$f":"'Trade Journal'!I56","v":0},{"$f":"'Trade Journal'!J56","v":0},{"$f":"'Trade Journal'!K56","v":0},{"$f":"'Trade Journal'!L56","v":1},{"$f":"'Trade Journal'!M56","v":0},{"$f":"'Trade Journal'!N56","v":0},{"$f":"'Trade Journal'!O56","v":0},{"$f":"'Trade Journal'!P56","v":0},{"$f":"'Trade Journal'!Q56","v":0},{"$f":"'Trade Journal'!R56","v":0},{"$f":"'Trade Journal'!S56","v":0},{"$f":"'Trade Journal'!T56","v":0},{"$f":"'Trade Journal'!U56","v":0},{"$f":"'Trade Journal'!V56","v":1},{"$f":"'Trade Journal'!W56","v":0},{"$f":"'Trade Journal'!X56","v":0},null,null,null,null,null,null,null,null,null,null,null,null,null,null,null,null,null,null,null,"Passage Rates"]
["Passengers",{"$f":"A6*AS6+A7*AS7+A8*AS8","v":31200},"Cr",null,null,null,null,null,null,null,null,null,null,null,null,null,null,null,null,null,null,null,null,null,null,null,null,null,null,null,null,null,null,null,null,null,null,null,null,"Parsecs Travelled","High","Middle","Low"]
[{"$f":"IF(OR(C6<AN18,C6=AN18),C6,AN18)","v":6},"Low Passages:",{"$f":"IF(VLOOKUP(Rolls!C44,'Trade Tables'!F4:L20,2)-VLOOKUP(Rolls!C44,'Trade Tables'!F4:L20,3)<0,0,VLOOKUP(Rolls!C44,'Trade Tables'!F4:L20,2)-VLOOKUP(Rolls!C44,'Trade Tables'!F4:L20,3))","v":28},null,null,null,null,null,null,null,null,null,null,null,null,null,null,null,null,null,null,null,null,null,null,null,null,null,null,null,null,null,null,null,null,null,null,null,null,1,6000,3000,1000,null,{"$f":"VLOOKUP(A4,AN6:AQ11,4,TRUE)","v":1200},{"$f":"AS6*A6","v":7200}]
{"$rows_left_out":63}
{"sheet":"World","index":2,"n_rows":39,"n_cols":8,"rows_kept":39,"cut":false,"hidden":false,"merged":[]}
[]
[null,"UWP: "]
[null,{"$f":"CONCATENATE(CONCATENATE(C7,\"     \",C8,\"    \",G7,DEC2HEX(Rolls!C2),DEC2HEX(Rolls!C3),DEC2HEX(Rolls!C5),DEC2HEX(Rolls!C6),DEC2HEX(Rolls!C7),DEC2HEX(Rolls!C12),\"-\",DEC2HEX(Rolls!C13),\" \"),CONCATENATE(IF(G22=\"yes\",CONCATENATE(\"  \",F22),\"\"),IF(G23=\"yes\",CONCATENATE(\"  \",F23),\"\"),IF(G24=\"yes\",CONCATENATE(\"  \",F24),\"\"),IF(G25=\"yes\",CONCATENATE(\"  \",F25),\"\"),IF(G26=\"yes\",CONCATENATE(\"  \",F26),\"\"),IF(G27=\"yes\",CONCATENATE(\"  \",F27),\"\"),IF(G28=\"yes\",CONCATENATE(\"  \",F28),\"\"),IF(G29=\"yes\",CONCATENATE(\"  \",F29),\"\"),IF(G30=\"yes\",CONCATENATE(\"  \",F30),\"\"),IF(G31=\"yes\",CONCATENATE(\"  \",F31),\"\"),IF(G32=\"yes\",CONCATENATE(\"  \",F32),\"\"),IF(G33=\"yes\",CONCATENATE(\"  \",F33),\"\"),IF(G34=\"yes\",CONCATENATE(\"  \",F34),\"\"),IF(G35=\"yes\",CONCATENATE(\"  \",F35),\"\"),IF(G36=\"yes\",CONCATENATE(\"  \",F36),\"\"),IF(G37=\"yes\",CONCATENATE(\"  \",F37),\"\"),IF(G38=\"yes\",CONCATENATE(\"  \",F38),\"\"),IF(G39=\"yes\",CONCATENATE(\"  \",F39),\"\")),\"      \",IF(C35=\"Amber\",\"A\",IF(C35=\"Red\",\"R\",\"\")))","v":"PLANET NAME     LOCATION    A686984-5   Ga  Hi  Lt      "}]
[]
[]
[null,"Planetary Info",null,null,null,"Starport"]
{"$rows_left_out":34}
{"sheet":"Animals","index":3,"n_rows":316,"n_cols":80,"rows_kept":316,"cut":false,"hidden":false,"merged":[]}
[]
[null,null,"Clear","Plain or Praire","Desert(hot or cold)","Hills, Foothills","Mountain","Forest","Woods","Jungle","Rainforest","Rough, Broken","Swamp, Marsh","Beach, Shore","Riverbank","Ocean Shallows","Open Ocean","Deep Ocean"]
[null,null,{"$f":"IF(AND(World!$G22=\"yes\",VLOOKUP(Animals!C$2,'Animal Tables'!$K$51:$AC$66,ROW(C3)-1,FALSE())),TRUE(),IF(World!$G22=\"no\",TRUE(),FALSE()))","v":true},{"$f":"IF(AND(World!$G22=\"yes\",VLOOKUP(Animals!D$2,'Animal Tables'!$K$51:$AC$66,ROW(D3)-1,FALSE())),TRUE(),IF(World!$G22=\"no\",TRUE(),FALSE()))","v":true},{"$f":"IF(AND(World!$G22=\"yes\",VLOOKUP(Animals!E$2,'Animal Tables'!$K$51:$AC$66,ROW(E3)-1,FALSE())),TRUE(),IF(World!$G22=\"no\",TRUE(),FALSE()))","v":true},{"$f":"IF(AND(World!$G22=\"yes\",VLOOKUP(Animals!F$2,'Animal Tables'!$K$51:$AC$66,ROW(F3)-1,FALSE())),TRUE(),IF(World!$G22=\"no\",TRUE(),FALSE()))","v":true},{"$f":"IF(AND(World!$G22=\"yes\",VLOOKUP(Animals!G$2,'Animal Tables'!$K$51:$AC$66,ROW(G3)-1,FALSE())),TRUE(),IF(World!$G22=\"no\",TRUE(),FALSE()))","v":true},{"$f":"IF(AND(World!$G22=\"yes\",VLOOKUP(Animals!H$2,'Animal Tables'!$K$51:$AC$66,ROW(H3)-1,FALSE())),TRUE(),IF(World!$G22=\"no\",TRUE(),FALSE()))","v":true},{"$f":"IF(AND(World!$G22=\"yes\",VLOOKUP(Animals!I$2,'Animal Tables'!$K$51:$AC$66,ROW(I3)-1,FALSE())),TRUE(),IF(World!$G22=\"no\",TRUE(),FALSE()))","v":true},{"$f":"IF(AND(World!$G22=\"yes\",VLOOKUP(Animals!J$2,'Animal Tables'!$K$51:$AC$66,ROW(J3)-1,FALSE())),TRUE(),IF(World!$G22=\"no\",TRUE(),FALSE()))","v":true},{"$f":"IF(AND(World!$G22=\"yes\",VLOOKUP(Animals!K$2,'Animal Tables'!$K$51:$AC$66,ROW(K3)-1,FALSE())),TRUE(),IF(World!$G22=\"no\",TRUE(),FALSE()))","v":true},{"$f":"IF(AND(World!$G22=\"yes\",VLOOKUP(Animals!L$2,'Animal Tables'!$K$51:$AC$66,ROW(L3)-1,FALSE())),TRUE(),IF(World!$G22=\"no\",TRUE(),FALSE()))","v":true},{"$f":"IF(AND(World!$G22=\"yes\",VLOOKUP(Animals!M$2,'Animal Tables'!$K$51:$AC$66,ROW(M3)-1,FALSE())),TRUE(),IF(World!$G22=\"no\",TRUE(),FALSE()))","v":true},{"$f":"IF(AND(World!$G22=\"yes\",VLOOKUP(Animals!N$2,'Animal Tables'!$K$51:$AC$66,ROW(N3)-1,FALSE())),TRUE(),IF(World!$G22=\"no\",TRUE(),FALSE()))","v":true},{"$f":"IF(AND(World!$G22=\"yes\",VLOOKUP(Animals!O$2,'Animal Tables'!$K$51:$AC$66,ROW(O3)-1,FALSE())),TRUE(),IF(World!$G22=\"no\",TRUE(),FALSE()))","v":true},{"$f":"IF(AND(World!$G22=\"yes\",VLOOKUP(Animals!P$2,'Animal Tables'!$K$51:$AC$66,ROW(P3)-1,FALSE())),TRUE(),IF(World!$G22=\"no\",TRUE(),FALSE()))","v":true},{"$f":"IF(AND(World!$G22=\"yes\",VLOOKUP(Animals!Q$2,'Animal Tables'!$K$51:$AC$66,ROW(Q3)-1,FALSE())),TRUE(),IF(World!$G22=\"no\",TRUE(),FALSE()))","v":true},{"$f":"IF(AND(World!$G22=\"yes\",VLOOKUP(Animals!R$2,'Animal Tables'!$K$51:$AC$66,ROW(R3)-1,FALSE())),TRUE(),IF(World!$G22=\"no\",TRUE(),FALSE()))","v":true}]
[null,null,{"$f":"IF(AND(World!$G23=\"yes\",VLOOKUP(Animals!C$2,'Animal Tables'!$K$51:$AC$66,ROW(C4)-1,FALSE())),TRUE(),IF(World!$G23=\"no\",TRUE(),FALSE()))","v":true},{"$f":"IF(AND(World!$G23=\"yes\",VLOOKUP(Animals!D$2,'Animal Tables'!$K$51:$AC$66,ROW(D4)-1,FALSE())),TRUE(),IF(World!$G23=\"no\",TRUE(),FALSE()))","v":true},{"$f":"IF(AND(World!$G23=\"yes\",VLOOKUP(Animals!E$2,'Animal Tables'!$K$51:$AC$66,ROW(E4)-1,FALSE())),TRUE(),IF(World!$G23=\"no\",TRUE(),FALSE()))","v":true},{"$f":"IF(AND(World!$G23=\"yes\",VLOOKUP(Animals!F$2,'Animal Tables'!$K$51:$AC$66,ROW(F4)-1,FALSE())),TRUE(),IF(World!$G23=\"no\",TRUE(),FALSE()))","v":true},{"$f":"IF(AND(World!$G23=\"yes\",VLOOKUP(Animals!G$2,'Animal Tables'!$K$51:$AC$66,ROW(G4)-1,FALSE())),TRUE(),IF(World!$G23=\"no\",TRUE(),FALSE()))","v":true},{"$f":"IF(AND(World!$G23=\"yes\",VLOOKUP(Animals!H$2,'Animal Tables'!$K$51:$AC$66,ROW(H4)-1,FALSE())),TRUE(),IF(World!$G23=\"no\",TRUE(),FALSE()))","v":true},{"$f":"IF(AND(World!$G23=\"yes\",VLOOKUP(Animals!I$2,'Animal Tables'!$K$51:$AC$66,ROW(I4)-1,FALSE())),TRUE(),IF(World!$G23=\"no\",TRUE(),FALSE()))","v":true},{"$f":"IF(AND(World!$G23=\"yes\",VLOOKUP(Animals!J$2,'Animal Tables'!$K$51:$AC$66,ROW(J4)-1,FALSE())),TRUE(),IF(World!$G23=\"no\",TRUE(),FALSE()))","v":true},{"$f":"IF(AND(World!$G23=\"yes\",VLOOKUP(Animals!K$2,'Animal Tables'!$K$51:$AC$66,ROW(K4)-1,FALSE())),TRUE(),IF(World!$G23=\"no\",TRUE(),FALSE()))","v":true},{"$f":"IF(AND(World!$G23=\"yes\",VLOOKUP(Animals!L$2,'Animal Tables'!$K$51:$AC$66,ROW(L4)-1,FALSE())),TRUE(),IF(World!$G23=\"no\",TRUE(),FALSE()))","v":true},{"$f":"IF(AND(World!$G23=\"yes\",VLOOKUP(Animals!M$2,'Animal Tables'!$K$51:$AC$66,ROW(M4)-1,FALSE())),TRUE(),IF(World!$G23=\"no\",TRUE(),FALSE()))","v":true},{"$f":"IF(AND(World!$G23=\"yes\",VLOOKUP(Animals!N$2,'Animal Tables'!$K$51:$AC$66,ROW(N4)-1,FALSE())),TRUE(),IF(World!$G23=\"no\",TRUE(),FALSE()))","v":true},{"$f":"IF(AND(World!$G23=\"yes\",VLOOKUP(Animals!O$2,'Animal Tables'!$K$51:$AC$66,ROW(O4)-1,FALSE())),TRUE(),IF(World!$G23=\"no\",TRUE(),FALSE()))","v":true},{"$f":"IF(AND(World!$G23=\"yes\",VLOOKUP(Animals!P$2,'Animal Tables'!$K$51:$AC$66,ROW(P4)-1,FALSE())),TRUE(),IF(World!$G23=\"no\",TRUE(),FALSE()))","v":true},{"$f":"IF(AND(World!$G23=\"yes\",VLOOKUP(Animals!Q$2,'Animal Tables'!$K$51:$AC$66,ROW(Q4)-1,FALSE())),TRUE(),IF(World!$G23=\"no\",TRUE(),FALSE()))","v":true},{"$f":"IF(AND(World!$G23=\"yes\",VLOOKUP(Animals!R$2,'Animal Tables'!$K$51:$AC$66,ROW(R4)-1,FALSE())),TRUE(),IF(World!$G23=\"no\",TRUE(),FALSE()))","v":true}]
[null,null,{"$f":"IF(AND(World!$G24=\"yes\",VLOOKUP(Animals!C$2,'Animal Tables'!$K$51:$AC$66,ROW(C5)-1,FALSE())),TRUE(),IF(World!$G24=\"no\",TRUE(),FALSE()))","v":true},{"$f":"IF(AND(World!$G24=\"yes\",VLOOKUP(Animals!D$2,'Animal Tables'!$K$51:$AC$66,ROW(D5)-1,FALSE())),TRUE(),IF(World!$G24=\"no\",TRUE(),FALSE()))","v":true},{"$f":"IF(AND(World!$G24=\"yes\",VLOOKUP(Animals!E$2,'Animal Tables'!$K$51:$AC$66,ROW(E5)-1,FALSE())),TRUE(),IF(World!$G24=\"no\",TRUE(),FALSE()))","v":true},{"$f":"IF(AND(World!$G24=\"yes\",VLOOKUP(Animals!F$2,'Animal Tables'!$K$51:$AC$66,ROW(F5)-1,FALSE())),TRUE(),IF(World!$G24=\"no\",TRUE(),FALSE()))","v":true},{"$f":"IF(AND(World!$G24=\"yes\",VLOOKUP(Animals!G$2,'Animal Tables'!$K$51:$AC$66,ROW(G5)-1,FALSE())),TRUE(),IF(World!$G24=\"no\",TRUE(),FALSE()))","v":true},{"$f":"IF(AND(World!$G24=\"yes\",VLOOKUP(Animals!H$2,'Animal Tables'!$K$51:$AC$66,ROW(H5)-1,FALSE())),TRUE(),IF(World!$G24=\"no\",TRUE(),FALSE()))","v":true},{"$f":"IF(AND(World!$G24=\"yes\",VLOOKUP(Animals!I$2,'Animal Tables'!$K$51:$AC$66,ROW(I5)-1,FALSE())),TRUE(),IF(World!$G24=\"no\",TRUE(),FALSE()))","v":true},{"$f":"IF(AND(World!$G24=\"yes\",VLOOKUP(Animals!J$2,'Animal Tables'!$K$51:$AC$66,ROW(J5)-1,FALSE())),TRUE(),IF(World!$G24=\"no\",TRUE(),FALSE()))","v":true},{"$f":"IF(AND(World!$G24=\"yes\",VLOOKUP(Animals!K$2,'Animal Tables'!$K$51:$AC$66,ROW(K5)-1,FALSE())),TRUE(),IF(World!$G24=\"no\",TRUE(),FALSE()))","v":true},{"$f":"IF(AND(World!$G24=\"yes\",VLOOKUP(Animals!L$2,'Animal Tables'!$K$51:$AC$66,ROW(L5)-1,FALSE())),TRUE(),IF(World!$G24=\"no\",TRUE(),FALSE()))","v":true},{"$f":"IF(AND(World!$G24=\"yes\",VLOOKUP(Animals!M$2,'Animal Tables'!$K$51:$AC$66,ROW(M5)-1,FALSE())),TRUE(),IF(World!$G24=\"no\",TRUE(),FALSE()))","v":true},{"$f":"IF(AND(World!$G24=\"yes\",VLOOKUP(Animals!N$2,'Animal Tables'!$K$51:$AC$66,ROW(N5)-1,FALSE())),TRUE(),IF(World!$G24=\"no\",TRUE(),FALSE()))","v":true},{"$f":"IF(AND(World!$G24=\"yes\",VLOOKUP(Animals!O$2,'Animal Tables'!$K$51:$AC$66,ROW(O5)-1,FALSE())),TRUE(),IF(World!$G24=\"no\",TRUE(),FALSE()))","v":true},{"$f":"IF(AND(World!$G24=\"yes\",VLOOKUP(Animals!P$2,'Animal Tables'!$K$51:$AC$66,ROW(P5)-1,FALSE())),TRUE(),IF(World!$G24=\"no\",TRUE(),FALSE()))","v":true},{"$f":"IF(AND(World!$G24=\"yes\",VLOOKUP(Animals!Q$2,'Animal Tables'!$K$51:$AC$66,ROW(Q5)-1,FALSE())),TRUE(),IF(World!$G24=\"no\",TRUE(),FALSE()))","v":true},{"$f":"IF(AND(World!$G24=\"yes\",VLOOKUP(Animals!R$2,'Animal Tables'!$K$51:$AC$66,ROW(R5)-1,FALSE())),TRUE(),IF(World!$G24=\"no\",TRUE(),FALSE()))","v":true}]
[null,null,{"$f":"IF(AND(World!$G25=\"yes\",VLOOKUP(Animals!C$2,'Animal Tables'!$K$51:$AC$66,ROW(C6)-1,FALSE())),TRUE(),IF(World!$G25=\"no\",TRUE(),FALSE()))","v":true},{"$f":"IF(AND(World!$G25=\"yes\",VLOOKUP(Animals!D$2,'Animal Tables'!$K$51:$AC$66,ROW(D6)-1,FALSE())),TRUE(),IF(World!$G25=\"no\",TRUE(),FALSE()))","v":true},{"$f":"IF(AND(World!$G25=\"yes\",VLOOKUP(Animals!E$2,'Animal Tables'!$K$51:$AC$66,ROW(E6)-1,FALSE())),TRUE(),IF(World!$G25=\"no\",TRUE(),FALSE()))","v":true},{"$f":"IF(AND(World!$G25=\"yes\",VLOOKUP(Animals!F$2,'Animal Tables'!$K$51:$AC$66,ROW(F6)-1,FALSE())),TRUE(),IF(World!$G25=\"no\",TRUE(),FALSE()))","v":true},{"$f":"IF(AND(World!$G25=\"yes\",VLOOKUP(Animals!G$2,'Animal Tables'!$K$51:$AC$66,ROW(G6)-1,FALSE())),TRUE(),IF(World!$G25=\"no\",TRUE(),FALSE()))","v":true},{"$f":"IF(AND(World!$G25=\"yes\",VLOOKUP(Animals!H$2,'Animal Tables'!$K$51:$AC$66,ROW(H6)-1,FALSE())),TRUE(),IF(World!$G25=\"no\",TRUE(),FALSE()))","v":true},{"$f":"IF(AND(World!$G25=\"yes\",VLOOKUP(Animals!I$2,'Animal Tables'!$K$51:$AC$66,ROW(I6)-1,FALSE())),TRUE(),IF(World!$G25=\"no\",TRUE(),FALSE()))","v":true},{"$f":"IF(AND(World!$G25=\"yes\",VLOOKUP(Animals!J$2,'Animal Tables'!$K$51:$AC$66,ROW(J6)-1,FALSE())),TRUE(),IF(World!$G25=\"no\",TRUE(),FALSE()))","v":true},{"$f":"IF(AND(World!$G25=\"yes\",VLOOKUP(Animals!K$2,'Animal Tables'!$K$51:$AC$66,ROW(K6)-1,FALSE())),TRUE(),IF(World!$G25=\"no\",TRUE(),FALSE()))","v":true},{"$f":"IF(AND(World!$G25=\"yes\",VLOOKUP(Animals!L$2,'Animal Tables'!$K$51:$AC$66,ROW(L6)-1,FALSE())),TRUE(),IF(World!$G25=\"no\",TRUE(),FALSE()))","v":true},{"$f":"IF(AND(World!$G25=\"yes\",VLOOKUP(Animals!M$2,'Animal Tables'!$K$51:$AC$66,ROW(M6)-1,FALSE())),TRUE(),IF(World!$G25=\"no\",TRUE(),FALSE()))","v":true},{"$f":"IF(AND(World!$G25=\"yes\",VLOOKUP(Animals!N$2,'Animal Tables'!$K$51:$AC$66,ROW(N6)-1,FALSE())),TRUE(),IF(World!$G25=\"no\",TRUE(),FALSE()))","v":true},{"$f":"IF(AND(World!$G25=\"yes\",VLOOKUP(Animals!O$2,'Animal Tables'!$K$51:$AC$66,ROW(O6)-1,FALSE())),TRUE(),IF(World!$G25=\"no\",TRUE(),FALSE()))","v":true},{"$f":"IF(AND(World!$G25=\"yes\",VLOOKUP(Animals!P$2,'Animal Tables'!$K$51:$AC$66,ROW(P6)-1,FALSE())),TRUE(),IF(World!$G25=\"no\",TRUE(),FALSE()))","v":true},{"$f":"IF(AND(World!$G25=\"yes\",VLOOKUP(Animals!Q$2,'Animal Tables'!$K$51:$AC$66,ROW(Q6)-1,FALSE())),TRUE(),IF(World!$G25=\"no\",TRUE(),FALSE()))","v":true},{"$f":"IF(AND(World!$G25=\"yes\",VLOOKUP(Animals!R$2,'Animal Tables'!$K$51:$AC$66,ROW(R6)-1,FALSE())),TRUE(),IF(World!$G25=\"no\",TRUE(),FALSE()))","v":true}]
{"$rows_left_out":311}
{"sheet":"Animal Tables","index":4,"n_rows":84,"n_cols":29,"rows_kept":84,"cut":false,"hidden":false,"merged":[]}
[]
["Planetary Quirks",null,null,null,null,null,null,null,null,null,null,null,null,null,null,null,null,"Number Encountered"]
["Roll","Sensory Quirks","Defense Quirk","Nesting Quirk","Locomotion Quirk","Reproduction quirk","Attack Quirk",null,null,null,null,null,null,null,null,null,null,"Pack","Num"]
[1,"Sees in infrared","Armoured shell","Digs burrows","Six limbs","Lays eggs","Acid spit",null,null,null,null,null,null,null,null,null,null,0,1]
[2,"Multiple eyes","Screeches for aid","Nests in trees","Gasbags","Lays thousands of spawn","Strangling tentacles",null,null,null,null,null,null,null,null,null,null,1,"1d3"]
[3,"Sensitive cilia or hairs","Reacts to attack with attack","Hides stocks of food","Crawls on webbing","Males gestate young","Primitive tools",null,null,null,null,null,null,null,null,null,null,2,"1d3"]
{"$rows_left_out":79}
{"sheet":"Trade Tables","index":5,"n_rows":123,"n_cols":42,"rows_kept":123,"cut":false,"hidden":false,"merged":[]}
[]
[null,"Passenger Traffic",null,null,null,"Avaliable Passengers",null,null,null,null,null,null,null,"Mail DMs"]
[null,"World Type","Current World","Destination World",null,"Passenger Traffic Value","Low Passages","(minus)","Middle Passages","(minus)","High Passages","(minus)",null,"FTM","DM"]
[null,"Agricultural",0,0,null,0,0,0,0,0,0,0,null,-10,-2]
[null,"Asteroid",1,-1,null,1,{"$f":"CEILING(6*RAND(),1)+CEILING(6*RAND(),1)","v":3},6,{"$f":"CEILING(6*RAND(),1)","v":3},2,0,0,null,-9,-1]
[null,"Barren",-5,-5,null,2,{"$f":"CEILING(6*RAND(),1)+CEILING(6*RAND(),1)","v":10},0,{"$f":"CEILING(6*RAND(),1)","v":1},0,{"$f":"CEILING(6*RAND(),1)","v":1},{"$f":"CEILING(6*RAND(),1)","v":3},null,-8,-1]
{"$rows_left_out":118}
{"sheet":"World Tables","index":6,"n_rows":54,"n_cols":10,"rows_kept":54,"cut":false,"hidden":false,"merged":[]}
[]
[null,"Size Table",null,null,null,"Atmosphere Table"]
[null,"Digit","World Size (km)","Surface Gravity",null,"Digit","Atmosphere","Pressure (Low)","Pressure(High)","Survival Gear Required"]
[null,0,800,0,null,0,"None",0,0,"Vacc Suit"]
[null,1,1600,0.05,null,1,"Trace",1E-3,0.09,"Vacc Suit"]
[null,2,3200,0.15,null,2,"Very Thin, Tainted",0.1,0.42,"Respirator, Filter"]
{"$rows_left_out":49}
{"sheet":"Civilization Tables","index":7,"n_rows":52,"n_cols":15,"rows_kept":52,"cut":false,"hidden":false,"merged":[]}
[]
[null,"Faction Strength Table",null,null,"Government Table",null,"Contraband"]
[null,"Roll","Relative Strength",null,"Type","Government","Weapons","Drugs","Information","Technology","Travellers","Psionics"]
[null,1,"Obscure",null,0,"Anarchy",0,0,0,0,0,0]
[null,2,"Obscure",null,1,"Company/Corporation",1,1,0,0,1,0]
[null,3,"Obscure",null,2,"Participating Democracy",0,1,0,0,0,0]
{"$rows_left_out":47}
{"sheet":"Rolls","index":8,"n_rows":99,"n_cols":15,"rows_kept":99,"cut":false,"hidden":false,"merged":[]}
["Enter UPP","World",null,null,null,null,null,null,null,null,null,null,null,null,1]
[{"$f":"HEX2DEC(Trade!D1)","v":6},"Size",{"$f":"IF(ISNUMBER(A2),A2,CEILING(6*RAND(),1)+CEILING(6*RAND(),1)-2)","v":6},"mod",{"$f":"RAND()","v":0.47891727852641264},null,null,null,{"$f":"IF(ISNUMBER(A2),A2,C2)","v":6}]
[{"$f":"HEX2DEC(Trade!E1)","v":8},"Atmosphere",{"$f":"IF(ISNUMBER(A3),A3,IF(G3<0,0,G3))","v":8},"mod",{"$f":"RAND()","v":0.22486357044221972},null,{"$f":"CEILING(6*RAND(),1)+CEILING(6*RAND(),1)-7+C2","v":7},null,8]
[null,"Temp",{"$f":"IF(ISNUMBER(A4),A4,IF(G4<0,0,IF(G4>12,12,G4)))","v":6},"mod",{"$f":"ROUND(RAND(),0.1)","v":0},{"$f":"ROUND(RAND(),0.1)","v":0},{"$f":"CEILING(6*RAND(),1)+CEILING(6*RAND(),1)+LOOKUP(C3,'World Tables'!E39:F54)+IF(E4=1,IF(F4=1,4,-4),0)","v":6},null,6]
[{"$f":"HEX2DEC(Trade!F1)","v":6},"Hydro",{"$f":"IF(ISNUMBER(A5),A5,IF(OR(C2=0,C2=1),0,IF(G5<0,0,IF(G5>10,10,G5))))","v":6},"mod",{"$f":"RAND()","v":0.89203246195230168},null,{"$f":"CEILING(6*RAND(),1)+CEILING(6*RAND(),1)-7+C2+IF(OR(C3=0,C3=1,C3=10,C3=11,C3=12),-4,0)+IF(AND(NOT(C3=13),OR(C4=10,C4=11)),-2,IF(AND(NOT(C3=13),C4=12),-6,0))","v":1},null,6]
[{"$f":"Trade!G1","v":8},"Population",{"$f":"CEILING(6*RAND(),1)+CEILING(6*RAND(),1)-2+CEILING(3*RAND(),1)-1","v":9},"mod",{"$f":"RAND()","v":0.11777970796162074},null,null,null,{"$f":"IF(ISNUMBER(A6),A6,C6)","v":8}]
{"$rows_left_out":93}